14:14:33.284 [ERROR] [org.gradle.internal.buildevents.BuildExceptionReporter] FAILURE: Build failed with an exception.
14:14:33.284 [ERROR] [org.gradle.internal.buildevents.BuildExceptionReporter] 
14:14:33.284 [ERROR] [org.gradle.internal.buildevents.BuildExceptionReporter] * What went wrong:
14:14:33.284 [ERROR] [org.gradle.internal.buildevents.BuildExceptionReporter] Could not determine the dependencies of task ':web:packageJson'.
14:14:33.284 [ERROR] [org.gradle.internal.buildevents.BuildExceptionReporter] > project ':api' is not configured for JS usage
14:14:33.284 [ERROR] [org.gradle.internal.buildevents.BuildExceptionReporter] 
14:14:33.284 [ERROR] [org.gradle.internal.buildevents.BuildExceptionReporter] * Try:
14:14:33.284 [ERROR] [org.gradle.internal.buildevents.BuildExceptionReporter]  Run with --scan to get full insights.
14:14:33.284 [ERROR] [org.gradle.internal.buildevents.BuildExceptionReporter] 
14:14:33.284 [ERROR] [org.gradle.internal.buildevents.BuildExceptionReporter] * Exception is:
14:14:33.285 [ERROR] [org.gradle.internal.buildevents.BuildExceptionReporter] org.gradle.api.internal.tasks.TaskDependencyResolveException: Could not determine the dependencies of task ':web:packageJson'.
14:14:33.285 [ERROR] [org.gradle.internal.buildevents.BuildExceptionReporter]   at org.gradle.api.internal.tasks.CachingTaskDependencyResolveContext.getDependencies(CachingTaskDependencyResolveContext.java:68)
14:14:33.285 [ERROR] [org.gradle.internal.buildevents.BuildExceptionReporter]   at org.gradle.execution.plan.TaskDependencyResolver.resolveDependenciesFor(TaskDependencyResolver.java:46)
14:14:33.285 [ERROR] [org.gradle.internal.buildevents.BuildExceptionReporter]   at org.gradle.execution.plan.LocalTaskNode.getDependencies(LocalTaskNode.java:106)
14:14:33.285 [ERROR] [org.gradle.internal.buildevents.BuildExceptionReporter]   at org.gradle.execution.plan.LocalTaskNode.resolveDependencies(LocalTaskNode.java:79)
14:14:33.285 [ERROR] [org.gradle.internal.buildevents.BuildExceptionReporter]   at org.gradle.execution.plan.DefaultExecutionPlan.addEntryTasks(DefaultExecutionPlan.java:176)
14:14:33.285 [ERROR] [org.gradle.internal.buildevents.BuildExceptionReporter]   at org.gradle.execution.taskgraph.DefaultTaskExecutionGraph.addEntryTasks(DefaultTaskExecutionGraph.java:139)
14:14:33.285 [ERROR] [org.gradle.internal.buildevents.BuildExceptionReporter]   at org.gradle.execution.TaskNameResolvingBuildConfigurationAction.configure(TaskNameResolvingBuildConfigurationAction.java:49)
14:14:33.285 [ERROR] [org.gradle.internal.buildevents.BuildExceptionReporter]   at org.gradle.execution.DefaultBuildConfigurationActionExecuter.configure(DefaultBuildConfigurationActionExecuter.java:58)
14:14:33.285 [ERROR] [org.gradle.internal.buildevents.BuildExceptionReporter]   at org.gradle.execution.DefaultBuildConfigurationActionExecuter.access$200(DefaultBuildConfigurationActionExecuter.java:26)
14:14:33.285 [ERROR] [org.gradle.internal.buildevents.BuildExceptionReporter]   at org.gradle.execution.DefaultBuildConfigurationActionExecuter$2.proceed(DefaultBuildConfigurationActionExecuter.java:66)
14:14:33.285 [ERROR] [org.gradle.internal.buildevents.BuildExceptionReporter]   at org.gradle.execution.DefaultTasksBuildExecutionAction.configure(DefaultTasksBuildExecutionAction.java:45)
14:14:33.285 [ERROR] [org.gradle.internal.buildevents.BuildExceptionReporter]   at org.gradle.execution.DefaultBuildConfigurationActionExecuter.configure(DefaultBuildConfigurationActionExecuter.java:58)
14:14:33.285 [ERROR] [org.gradle.internal.buildevents.BuildExceptionReporter]   at org.gradle.execution.DefaultBuildConfigurationActionExecuter.access$200(DefaultBuildConfigurationActionExecuter.java:26)
14:14:33.285 [ERROR] [org.gradle.internal.buildevents.BuildExceptionReporter]   at org.gradle.execution.DefaultBuildConfigurationActionExecuter$2.proceed(DefaultBuildConfigurationActionExecuter.java:66)
14:14:33.285 [ERROR] [org.gradle.internal.buildevents.BuildExceptionReporter]   at org.gradle.execution.ExcludedTaskFilteringBuildConfigurationAction.configure(ExcludedTaskFilteringBuildConfigurationAction.java:48)
14:14:33.285 [ERROR] [org.gradle.internal.buildevents.BuildExceptionReporter]   at org.gradle.execution.DefaultBuildConfigurationActionExecuter.configure(DefaultBuildConfigurationActionExecuter.java:58)
14:14:33.285 [ERROR] [org.gradle.internal.buildevents.BuildExceptionReporter]   at org.gradle.execution.DefaultBuildConfigurationActionExecuter.access$200(DefaultBuildConfigurationActionExecuter.java:26)
14:14:33.285 [ERROR] [org.gradle.internal.buildevents.BuildExceptionReporter]   at org.gradle.execution.DefaultBuildConfigurationActionExecuter$1.run(DefaultBuildConfigurationActionExecuter.java:44)
14:14:33.285 [ERROR] [org.gradle.internal.buildevents.BuildExceptionReporter]   at org.gradle.internal.Factories$1.create(Factories.java:26)
14:14:33.285 [ERROR] [org.gradle.internal.buildevents.BuildExceptionReporter]   at org.gradle.api.internal.project.DefaultProjectStateRegistry.withLenientState(DefaultProjectStateRegistry.java:133)
14:14:33.285 [ERROR] [org.gradle.internal.buildevents.BuildExceptionReporter]   at org.gradle.api.internal.project.DefaultProjectStateRegistry.withLenientState(DefaultProjectStateRegistry.java:125)
14:14:33.285 [ERROR] [org.gradle.internal.buildevents.BuildExceptionReporter]   at org.gradle.execution.DefaultBuildConfigurationActionExecuter.select(DefaultBuildConfigurationActionExecuter.java:40)
14:14:33.285 [ERROR] [org.gradle.internal.buildevents.BuildExceptionReporter]   at org.gradle.initialization.DefaultTaskExecutionPreparer.prepareForTaskExecution(DefaultTaskExecutionPreparer.java:38)
14:14:33.285 [ERROR] [org.gradle.internal.buildevents.BuildExceptionReporter]   at org.gradle.initialization.BuildOperatingFiringTaskExecutionPreparer$CalculateTaskGraph.populateTaskGraph(BuildOperatingFiringTaskExecutionPreparer.java:82)
14:14:33.285 [ERROR] [org.gradle.internal.buildevents.BuildExceptionReporter]   at org.gradle.initialization.BuildOperatingFiringTaskExecutionPreparer$CalculateTaskGraph.run(BuildOperatingFiringTaskExecutionPreparer.java:57)
14:14:33.285 [ERROR] [org.gradle.internal.buildevents.BuildExceptionReporter]   at org.gradle.internal.operations.DefaultBuildOperationExecutor$RunnableBuildOperationWorker.execute(DefaultBuildOperationExecutor.java:402)
14:14:33.286 [ERROR] [org.gradle.internal.buildevents.BuildExceptionReporter]   at org.gradle.internal.operations.DefaultBuildOperationExecutor$RunnableBuildOperationWorker.execute(DefaultBuildOperationExecutor.java:394)
14:14:33.286 [ERROR] [org.gradle.internal.buildevents.BuildExceptionReporter]   at org.gradle.internal.operations.DefaultBuildOperationExecutor$1.execute(DefaultBuildOperationExecutor.java:165)
14:14:33.286 [ERROR] [org.gradle.internal.buildevents.BuildExceptionReporter]   at org.gradle.internal.operations.DefaultBuildOperationExecutor.execute(DefaultBuildOperationExecutor.java:250)
14:14:33.286 [ERROR] [org.gradle.internal.buildevents.BuildExceptionReporter]   at org.gradle.internal.operations.DefaultBuildOperationExecutor.execute(DefaultBuildOperationExecutor.java:158)
14:14:33.286 [ERROR] [org.gradle.internal.buildevents.BuildExceptionReporter]   at org.gradle.internal.operations.DefaultBuildOperationExecutor.run(DefaultBuildOperationExecutor.java:92)
14:14:33.286 [ERROR] [org.gradle.internal.buildevents.BuildExceptionReporter]   at org.gradle.internal.operations.DelegatingBuildOperationExecutor.run(DelegatingBuildOperationExecutor.java:31)
14:14:33.286 [ERROR] [org.gradle.internal.buildevents.BuildExceptionReporter]   at org.gradle.initialization.BuildOperatingFiringTaskExecutionPreparer.prepareForTaskExecution(BuildOperatingFiringTaskExecutionPreparer.java:45)
14:14:33.286 [ERROR] [org.gradle.internal.buildevents.BuildExceptionReporter]   at org.gradle.initialization.DefaultGradleLauncher.prepareTaskExecution(DefaultGradleLauncher.java:206)
14:14:33.286 [ERROR] [org.gradle.internal.buildevents.BuildExceptionReporter]   at org.gradle.initialization.DefaultGradleLauncher.doClassicBuildStages(DefaultGradleLauncher.java:142)
14:14:33.286 [ERROR] [org.gradle.internal.buildevents.BuildExceptionReporter]   at org.gradle.initialization.DefaultGradleLauncher.doBuildStages(DefaultGradleLauncher.java:126)
14:14:33.286 [ERROR] [org.gradle.internal.buildevents.BuildExceptionReporter]   at org.gradle.initialization.DefaultGradleLauncher.executeTasks(DefaultGradleLauncher.java:106)
14:14:33.286 [ERROR] [org.gradle.internal.buildevents.BuildExceptionReporter]   at org.gradle.internal.invocation.GradleBuildController$1.execute(GradleBuildController.java:60)
14:14:33.286 [ERROR] [org.gradle.internal.buildevents.BuildExceptionReporter]   at org.gradle.internal.invocation.GradleBuildController$1.execute(GradleBuildController.java:57)
14:14:33.286 [ERROR] [org.gradle.internal.buildevents.BuildExceptionReporter]   at org.gradle.internal.invocation.GradleBuildController$3.create(GradleBuildController.java:85)
14:14:33.286 [ERROR] [org.gradle.internal.buildevents.BuildExceptionReporter]   at org.gradle.internal.invocation.GradleBuildController$3.create(GradleBuildController.java:78)
14:14:33.286 [ERROR] [org.gradle.internal.buildevents.BuildExceptionReporter]   at org.gradle.internal.work.DefaultWorkerLeaseService.withLocks(DefaultWorkerLeaseService.java:189)
14:14:33.286 [ERROR] [org.gradle.internal.buildevents.BuildExceptionReporter]   at org.gradle.internal.work.StopShieldingWorkerLeaseService.withLocks(StopShieldingWorkerLeaseService.java:40)
14:14:33.286 [ERROR] [org.gradle.internal.buildevents.BuildExceptionReporter]   at org.gradle.internal.invocation.GradleBuildController.doBuild(GradleBuildController.java:78)
14:14:33.286 [ERROR] [org.gradle.internal.buildevents.BuildExceptionReporter]   at org.gradle.internal.invocation.GradleBuildController.run(GradleBuildController.java:57)
14:14:33.286 [ERROR] [org.gradle.internal.buildevents.BuildExceptionReporter]   at org.gradle.tooling.internal.provider.ExecuteBuildActionRunner.run(ExecuteBuildActionRunner.java:31)
14:14:33.286 [ERROR] [org.gradle.internal.buildevents.BuildExceptionReporter]   at org.gradle.launcher.exec.ChainingBuildActionRunner.run(ChainingBuildActionRunner.java:35)
14:14:33.286 [ERROR] [org.gradle.internal.buildevents.BuildExceptionReporter]   at org.gradle.launcher.exec.BuildOutcomeReportingBuildActionRunner.run(BuildOutcomeReportingBuildActionRunner.java:63)
14:14:33.286 [ERROR] [org.gradle.internal.buildevents.BuildExceptionReporter]   at org.gradle.tooling.internal.provider.ValidatingBuildActionRunner.run(ValidatingBuildActionRunner.java:32)
14:14:33.286 [ERROR] [org.gradle.internal.buildevents.BuildExceptionReporter]   at org.gradle.launcher.exec.BuildCompletionNotifyingBuildActionRunner.run(BuildCompletionNotifyingBuildActionRunner.java:39)
14:14:33.287 [ERROR] [org.gradle.internal.buildevents.BuildExceptionReporter]   at org.gradle.launcher.exec.RunAsBuildOperationBuildActionRunner$3.call(RunAsBuildOperationBuildActionRunner.java:51)
14:14:33.287 [ERROR] [org.gradle.internal.buildevents.BuildExceptionReporter]   at org.gradle.launcher.exec.RunAsBuildOperationBuildActionRunner$3.call(RunAsBuildOperationBuildActionRunner.java:45)
14:14:33.287 [ERROR] [org.gradle.internal.buildevents.BuildExceptionReporter]   at org.gradle.internal.operations.DefaultBuildOperationExecutor$CallableBuildOperationWorker.execute(DefaultBuildOperationExecutor.java:416)
14:14:33.287 [ERROR] [org.gradle.internal.buildevents.BuildExceptionReporter]   at org.gradle.internal.operations.DefaultBuildOperationExecutor$CallableBuildOperationWorker.execute(DefaultBuildOperationExecutor.java:406)
14:14:33.287 [ERROR] [org.gradle.internal.buildevents.BuildExceptionReporter]   at org.gradle.internal.operations.DefaultBuildOperationExecutor$1.execute(DefaultBuildOperationExecutor.java:165)
14:14:33.287 [ERROR] [org.gradle.internal.buildevents.BuildExceptionReporter]   at org.gradle.internal.operations.DefaultBuildOperationExecutor.execute(DefaultBuildOperationExecutor.java:250)
14:14:33.287 [ERROR] [org.gradle.internal.buildevents.BuildExceptionReporter]   at org.gradle.internal.operations.DefaultBuildOperationExecutor.execute(DefaultBuildOperationExecutor.java:158)
14:14:33.287 [ERROR] [org.gradle.internal.buildevents.BuildExceptionReporter]   at org.gradle.internal.operations.DefaultBuildOperationExecutor.call(DefaultBuildOperationExecutor.java:102)
14:14:33.287 [ERROR] [org.gradle.internal.buildevents.BuildExceptionReporter]   at org.gradle.internal.operations.DelegatingBuildOperationExecutor.call(DelegatingBuildOperationExecutor.java:36)
14:14:33.287 [ERROR] [org.gradle.internal.buildevents.BuildExceptionReporter]   at org.gradle.launcher.exec.RunAsBuildOperationBuildActionRunner.run(RunAsBuildOperationBuildActionRunner.java:45)
14:14:33.287 [ERROR] [org.gradle.internal.buildevents.BuildExceptionReporter]   at org.gradle.launcher.exec.InProcessBuildActionExecuter$1.transform(InProcessBuildActionExecuter.java:50)
14:14:33.287 [ERROR] [org.gradle.internal.buildevents.BuildExceptionReporter]   at org.gradle.launcher.exec.InProcessBuildActionExecuter$1.transform(InProcessBuildActionExecuter.java:47)
14:14:33.287 [ERROR] [org.gradle.internal.buildevents.BuildExceptionReporter]   at org.gradle.composite.internal.DefaultRootBuildState.run(DefaultRootBuildState.java:78)
14:14:33.287 [ERROR] [org.gradle.internal.buildevents.BuildExceptionReporter]   at org.gradle.launcher.exec.InProcessBuildActionExecuter.execute(InProcessBuildActionExecuter.java:47)
14:14:33.287 [ERROR] [org.gradle.internal.buildevents.BuildExceptionReporter]   at org.gradle.launcher.exec.InProcessBuildActionExecuter.execute(InProcessBuildActionExecuter.java:31)
14:14:33.287 [ERROR] [org.gradle.internal.buildevents.BuildExceptionReporter]   at org.gradle.launcher.exec.BuildTreeScopeBuildActionExecuter.execute(BuildTreeScopeBuildActionExecuter.java:42)
14:14:33.287 [ERROR] [org.gradle.internal.buildevents.BuildExceptionReporter]   at org.gradle.launcher.exec.BuildTreeScopeBuildActionExecuter.execute(BuildTreeScopeBuildActionExecuter.java:28)
14:14:33.287 [ERROR] [org.gradle.internal.buildevents.BuildExceptionReporter]   at org.gradle.tooling.internal.provider.ContinuousBuildActionExecuter.execute(ContinuousBuildActionExecuter.java:78)
14:14:33.287 [ERROR] [org.gradle.internal.buildevents.BuildExceptionReporter]   at org.gradle.tooling.internal.provider.ContinuousBuildActionExecuter.execute(ContinuousBuildActionExecuter.java:52)
14:14:33.287 [ERROR] [org.gradle.internal.buildevents.BuildExceptionReporter]   at org.gradle.tooling.internal.provider.SubscribableBuildActionExecuter.execute(SubscribableBuildActionExecuter.java:59)
14:14:33.287 [ERROR] [org.gradle.internal.buildevents.BuildExceptionReporter]   at org.gradle.tooling.internal.provider.SubscribableBuildActionExecuter.execute(SubscribableBuildActionExecuter.java:36)
14:14:33.288 [ERROR] [org.gradle.internal.buildevents.BuildExceptionReporter]   at org.gradle.tooling.internal.provider.SessionScopeBuildActionExecuter.execute(SessionScopeBuildActionExecuter.java:68)
14:14:33.288 [ERROR] [org.gradle.internal.buildevents.BuildExceptionReporter]   at org.gradle.tooling.internal.provider.SessionScopeBuildActionExecuter.execute(SessionScopeBuildActionExecuter.java:38)
14:14:33.288 [ERROR] [org.gradle.internal.buildevents.BuildExceptionReporter]   at org.gradle.tooling.internal.provider.GradleThreadBuildActionExecuter.execute(GradleThreadBuildActionExecuter.java:37)
14:14:33.288 [ERROR] [org.gradle.internal.buildevents.BuildExceptionReporter]   at org.gradle.tooling.internal.provider.GradleThreadBuildActionExecuter.execute(GradleThreadBuildActionExecuter.java:26)
14:14:33.288 [ERROR] [org.gradle.internal.buildevents.BuildExceptionReporter]   at org.gradle.tooling.internal.provider.ParallelismConfigurationBuildActionExecuter.execute(ParallelismConfigurationBuildActionExecuter.java:43)
14:14:33.288 [ERROR] [org.gradle.internal.buildevents.BuildExceptionReporter]   at org.gradle.tooling.internal.provider.ParallelismConfigurationBuildActionExecuter.execute(ParallelismConfigurationBuildActionExecuter.java:29)
14:14:33.288 [ERROR] [org.gradle.internal.buildevents.BuildExceptionReporter]   at org.gradle.tooling.internal.provider.StartParamsValidatingActionExecuter.execute(StartParamsValidatingActionExecuter.java:60)
14:14:33.288 [ERROR] [org.gradle.internal.buildevents.BuildExceptionReporter]   at org.gradle.tooling.internal.provider.StartParamsValidatingActionExecuter.execute(StartParamsValidatingActionExecuter.java:32)
14:14:33.288 [ERROR] [org.gradle.internal.buildevents.BuildExceptionReporter]   at org.gradle.tooling.internal.provider.SessionFailureReportingActionExecuter.execute(SessionFailureReportingActionExecuter.java:55)
14:14:33.288 [ERROR] [org.gradle.internal.buildevents.BuildExceptionReporter]   at org.gradle.tooling.internal.provider.SessionFailureReportingActionExecuter.execute(SessionFailureReportingActionExecuter.java:41)
14:14:33.288 [ERROR] [org.gradle.internal.buildevents.BuildExceptionReporter]   at org.gradle.tooling.internal.provider.SetupLoggingActionExecuter.execute(SetupLoggingActionExecuter.java:48)
14:14:33.288 [ERROR] [org.gradle.internal.buildevents.BuildExceptionReporter]   at org.gradle.tooling.internal.provider.SetupLoggingActionExecuter.execute(SetupLoggingActionExecuter.java:32)
14:14:33.288 [ERROR] [org.gradle.internal.buildevents.BuildExceptionReporter]   at org.gradle.launcher.daemon.server.exec.ExecuteBuild.doBuild(ExecuteBuild.java:68)
14:14:33.288 [ERROR] [org.gradle.internal.buildevents.BuildExceptionReporter]   at org.gradle.launcher.daemon.server.exec.BuildCommandOnly.execute(BuildCommandOnly.java:37)
14:14:33.288 [ERROR] [org.gradle.internal.buildevents.BuildExceptionReporter]   at org.gradle.launcher.daemon.server.api.DaemonCommandExecution.proceed(DaemonCommandExecution.java:104)
14:14:33.288 [ERROR] [org.gradle.internal.buildevents.BuildExceptionReporter]   at org.gradle.launcher.daemon.server.exec.WatchForDisconnection.execute(WatchForDisconnection.java:39)
14:14:33.288 [ERROR] [org.gradle.internal.buildevents.BuildExceptionReporter]   at org.gradle.launcher.daemon.server.api.DaemonCommandExecution.proceed(DaemonCommandExecution.java:104)
14:14:33.288 [ERROR] [org.gradle.internal.buildevents.BuildExceptionReporter]   at org.gradle.launcher.daemon.server.exec.ResetDeprecationLogger.execute(ResetDeprecationLogger.java:27)
14:14:33.288 [ERROR] [org.gradle.internal.buildevents.BuildExceptionReporter]   at org.gradle.launcher.daemon.server.api.DaemonCommandExecution.proceed(DaemonCommandExecution.java:104)
14:14:33.288 [ERROR] [org.gradle.internal.buildevents.BuildExceptionReporter]   at org.gradle.launcher.daemon.server.exec.RequestStopIfSingleUsedDaemon.execute(RequestStopIfSingleUsedDaemon.java:35)
14:14:33.288 [ERROR] [org.gradle.internal.buildevents.BuildExceptionReporter]   at org.gradle.launcher.daemon.server.api.DaemonCommandExecution.proceed(DaemonCommandExecution.java:104)
14:14:33.289 [ERROR] [org.gradle.internal.buildevents.BuildExceptionReporter]   at org.gradle.launcher.daemon.server.exec.ForwardClientInput$2.create(ForwardClientInput.java:78)
14:14:33.289 [ERROR] [org.gradle.internal.buildevents.BuildExceptionReporter]   at org.gradle.launcher.daemon.server.exec.ForwardClientInput$2.create(ForwardClientInput.java:75)
14:14:33.289 [ERROR] [org.gradle.internal.buildevents.BuildExceptionReporter]   at org.gradle.util.Swapper.swap(Swapper.java:38)
14:14:33.289 [ERROR] [org.gradle.internal.buildevents.BuildExceptionReporter]   at org.gradle.launcher.daemon.server.exec.ForwardClientInput.execute(ForwardClientInput.java:75)
14:14:33.289 [ERROR] [org.gradle.internal.buildevents.BuildExceptionReporter]   at org.gradle.launcher.daemon.server.api.DaemonCommandExecution.proceed(DaemonCommandExecution.java:104)
14:14:33.289 [ERROR] [org.gradle.internal.buildevents.BuildExceptionReporter]   at org.gradle.launcher.daemon.server.exec.LogAndCheckHealth.execute(LogAndCheckHealth.java:55)
14:14:33.289 [ERROR] [org.gradle.internal.buildevents.BuildExceptionReporter]   at org.gradle.launcher.daemon.server.api.DaemonCommandExecution.proceed(DaemonCommandExecution.java:104)
14:14:33.289 [ERROR] [org.gradle.internal.buildevents.BuildExceptionReporter]   at org.gradle.launcher.daemon.server.exec.LogToClient.doBuild(LogToClient.java:63)
14:14:33.289 [ERROR] [org.gradle.internal.buildevents.BuildExceptionReporter]   at org.gradle.launcher.daemon.server.exec.BuildCommandOnly.execute(BuildCommandOnly.java:37)
14:14:33.289 [ERROR] [org.gradle.internal.buildevents.BuildExceptionReporter]   at org.gradle.launcher.daemon.server.api.DaemonCommandExecution.proceed(DaemonCommandExecution.java:104)
14:14:33.289 [ERROR] [org.gradle.internal.buildevents.BuildExceptionReporter]   at org.gradle.launcher.daemon.server.exec.EstablishBuildEnvironment.doBuild(EstablishBuildEnvironment.java:82)
14:14:33.291 [ERROR] [org.gradle.internal.buildevents.BuildExceptionReporter]   at org.gradle.launcher.daemon.server.exec.BuildCommandOnly.execute(BuildCommandOnly.java:37)
14:14:33.291 [ERROR] [org.gradle.internal.buildevents.BuildExceptionReporter]   at org.gradle.launcher.daemon.server.api.DaemonCommandExecution.proceed(DaemonCommandExecution.java:104)
14:14:33.291 [ERROR] [org.gradle.internal.buildevents.BuildExceptionReporter]   at org.gradle.launcher.daemon.server.exec.StartBuildOrRespondWithBusy$1.run(StartBuildOrRespondWithBusy.java:52)
14:14:33.291 [ERROR] [org.gradle.internal.buildevents.BuildExceptionReporter]   at org.gradle.launcher.daemon.server.DaemonStateCoordinator$1.run(DaemonStateCoordinator.java:297)
14:14:33.291 [ERROR] [org.gradle.internal.buildevents.BuildExceptionReporter]   at org.gradle.internal.concurrent.ExecutorPolicy$CatchAndRecordFailures.onExecute(ExecutorPolicy.java:64)
14:14:33.291 [ERROR] [org.gradle.internal.buildevents.BuildExceptionReporter]   at org.gradle.internal.concurrent.ManagedExecutorImpl$1.run(ManagedExecutorImpl.java:48)
14:14:33.291 [ERROR] [org.gradle.internal.buildevents.BuildExceptionReporter]   at org.gradle.internal.concurrent.ThreadFactoryImpl$ManagedThreadRunnable.run(ThreadFactoryImpl.java:56)
14:14:33.291 [ERROR] [org.gradle.internal.buildevents.BuildExceptionReporter] Caused by: java.lang.IllegalStateException: project ':api' is not configured for JS usage
14:14:33.291 [ERROR] [org.gradle.internal.buildevents.BuildExceptionReporter]   at org.jetbrains.kotlin.gradle.targets.js.npm.resolver.KotlinRootNpmResolver.get(KotlinRootNpmResolver.kt:49)
14:14:33.291 [ERROR] [org.gradle.internal.buildevents.BuildExceptionReporter]   at org.jetbrains.kotlin.gradle.targets.js.npm.resolver.KotlinRootNpmResolver.findDependentResolver(KotlinRootNpmResolver.kt:56)
14:14:33.292 [ERROR] [org.gradle.internal.buildevents.BuildExceptionReporter]   at org.jetbrains.kotlin.gradle.targets.js.npm.resolver.KotlinCompilationNpmResolver$ConfigurationVisitor.visitArtifacts(KotlinCompilationNpmResolver.kt:187)
14:14:33.292 [ERROR] [org.gradle.internal.buildevents.BuildExceptionReporter]   at org.jetbrains.kotlin.gradle.targets.js.npm.resolver.KotlinCompilationNpmResolver$ConfigurationVisitor.visitDependency(KotlinCompilationNpmResolver.kt:170)
14:14:33.292 [ERROR] [org.gradle.internal.buildevents.BuildExceptionReporter]   at org.jetbrains.kotlin.gradle.targets.js.npm.resolver.KotlinCompilationNpmResolver$ConfigurationVisitor.visit(KotlinCompilationNpmResolver.kt:145)
14:14:33.292 [ERROR] [org.gradle.internal.buildevents.BuildExceptionReporter]   at org.jetbrains.kotlin.gradle.targets.js.npm.resolver.KotlinCompilationNpmResolver$packageJsonProducer$2.invoke(KotlinCompilationNpmResolver.kt:56)
14:14:33.292 [ERROR] [org.gradle.internal.buildevents.BuildExceptionReporter]   at org.jetbrains.kotlin.gradle.targets.js.npm.resolver.KotlinCompilationNpmResolver$packageJsonProducer$2.invoke(KotlinCompilationNpmResolver.kt:34)
14:14:33.292 [ERROR] [org.gradle.internal.buildevents.BuildExceptionReporter]   at kotlin.SynchronizedLazyImpl.getValue(LazyJVM.kt:74)
14:14:33.292 [ERROR] [org.gradle.internal.buildevents.BuildExceptionReporter]   at org.jetbrains.kotlin.gradle.targets.js.npm.resolver.KotlinCompilationNpmResolver.getPackageJsonProducer(KotlinCompilationNpmResolver.kt)
14:14:33.292 [ERROR] [org.gradle.internal.buildevents.BuildExceptionReporter]   at org.jetbrains.kotlin.gradle.targets.js.npm.tasks.KotlinPackageJsonTask.getProducer(KotlinPackageJsonTask.kt:27)
14:14:33.292 [ERROR] [org.gradle.internal.buildevents.BuildExceptionReporter]   at org.jetbrains.kotlin.gradle.targets.js.npm.tasks.KotlinPackageJsonTask.findDependentTasks(KotlinPackageJsonTask.kt:30)
14:14:33.292 [ERROR] [org.gradle.internal.buildevents.BuildExceptionReporter]   at org.jetbrains.kotlin.gradle.targets.js.npm.tasks.KotlinPackageJsonTask.access$findDependentTasks(KotlinPackageJsonTask.kt:19)
14:14:33.292 [ERROR] [org.gradle.internal.buildevents.BuildExceptionReporter]   at org.jetbrains.kotlin.gradle.targets.js.npm.tasks.KotlinPackageJsonTask$Companion$create$packageJsonTask$1$1.call(KotlinPackageJsonTask.kt:63)
14:14:33.292 [ERROR] [org.gradle.internal.buildevents.BuildExceptionReporter]   at org.jetbrains.kotlin.gradle.targets.js.npm.tasks.KotlinPackageJsonTask$Companion$create$packageJsonTask$1$1.call(KotlinPackageJsonTask.kt:47)
14:14:33.292 [ERROR] [org.gradle.internal.buildevents.BuildExceptionReporter]   at org.gradle.api.internal.provider.DefaultProvider.getOrNull(DefaultProvider.java:41)
14:14:33.292 [ERROR] [org.gradle.internal.buildevents.BuildExceptionReporter]   at org.gradle.api.internal.provider.AbstractReadOnlyProvider.get(AbstractReadOnlyProvider.java:27)
14:14:33.292 [ERROR] [org.gradle.internal.buildevents.BuildExceptionReporter]   at org.gradle.api.internal.tasks.DefaultTaskDependency.visitDependencies(DefaultTaskDependency.java:96)
14:14:33.292 [ERROR] [org.gradle.internal.buildevents.BuildExceptionReporter]   at org.gradle.api.internal.tasks.CachingTaskDependencyResolveContext$TaskGraphImpl.getNodeValues(CachingTaskDependencyResolveContext.java:111)
14:14:33.292 [ERROR] [org.gradle.internal.buildevents.BuildExceptionReporter]   at org.gradle.internal.graph.CachingDirectedGraphWalker$GraphWithEmptyEdges.getNodeValues(CachingDirectedGraphWalker.java:213)
14:14:33.292 [ERROR] [org.gradle.internal.buildevents.BuildExceptionReporter]   at org.gradle.internal.graph.CachingDirectedGraphWalker.doSearch(CachingDirectedGraphWalker.java:121)
14:14:33.292 [ERROR] [org.gradle.internal.buildevents.BuildExceptionReporter]   at org.gradle.internal.graph.CachingDirectedGraphWalker.findValues(CachingDirectedGraphWalker.java:73)
14:14:33.292 [ERROR] [org.gradle.internal.buildevents.BuildExceptionReporter]   at org.gradle.api.internal.tasks.CachingTaskDependencyResolveContext.getDependencies(CachingTaskDependencyResolveContext.java:66)
14:14:33.293 [ERROR] [org.gradle.internal.buildevents.BuildExceptionReporter]   ... 109 more
14:14:33.293 [ERROR] [org.gradle.internal.buildevents.BuildExceptionReporter] 
14:14:33.293 [ERROR] [org.gradle.internal.buildevents.BuildExceptionReporter] 
```